Reaction Details
TargetGlycogen synthase kinase-3 beta
LigandBDBM50026842
Substrate/Competitorn/a
Meas. Tech.ChEMBL_807301 (CHEMBL1960394)
IC50 3162±n/a nM
Citation Gentile, GMerlo, GPozzan, ABernasconi, GBax, BBamborough, PBridges, ACarter, PNeu, MYao, GBrough, CCutler, GCoffin, ABelyanskaya, S 5-Aryl-4-carboxamide-1,3-oxazoles: potent and selective GSK-3 inhibitors. Bioorg Med Chem Lett22:1989-94 (2012) 
 
Glycogen synthase kinase-3 beta
Name:Glycogen synthase kinase-3 beta
Type:Enzyme
Mol. Mass.:46756.38
Organism:Homo sapiens (Human)
Description:P49841
Residue:420
BDBM50026842
NameBDBM50026842
Synonyms:CHEMBL1957100
TypeSmall organic molecule
Emp. Form.C16H13ClN4O3
Mol. Mass.344.752
SMILESCOc1ccc(nc1Cl)-c1ocnc1C(=O)NCc1ccncc1