Reaction Details
TargetAurora kinase A
LigandBDBM50365426
Substrate/Competitorn/a
Meas. Tech.ChEMBL_807287 (CHEMBL1960380)
IC50>10000±n/a nM
Citation Gentile, GMerlo, GPozzan, ABernasconi, GBax, BBamborough, PBridges, ACarter, PNeu, MYao, GBrough, CCutler, GCoffin, ABelyanskaya, S 5-Aryl-4-carboxamide-1,3-oxazoles: potent and selective GSK-3 inhibitors. Bioorg Med Chem Lett22:1989-94 (2012) 
 
Aurora kinase A
Name:Aurora kinase A
Type:Serine/threonine-protein kinase
Mol. Mass.:45830.98
Organism:Homo sapiens (Human)
Description:O14965
Residue:403
BDBM50365426
NameBDBM50365426
Synonyms:CHEMBL1957085
TypeSmall organic molecule
Emp. Form.C17H15N3O3
Mol. Mass.309.3193
SMILESCOc1ccc(cc1)-c1ocnc1C(=O)NCc1ccncc1