Reaction Details
TargetGrowth hormone secretagogue receptor type 1
LigandBDBM50365830
Substrate/Competitorn/a
Meas. Tech.ChEMBL_806242 (CHEMBL1958783)
Ki 0.270000±n/a nM
Citation Hanrahan, PBell, JBottomley, GBradley, SClarke, PCurtis, EDavis, SDawson, GHorswill, JKeily, JMoore, GRasamison, CBloxham, J Substituted azaquinazolinones as modulators of GHSr-1a for the treatment of type II diabetes and obesity. Bioorg Med Chem Lett22:2271-8 (2012) 
 
Growth hormone secretagogue receptor type 1
Name:Growth hormone secretagogue receptor type 1
Type:Receptor
Mol. Mass.:41334.57
Organism:Homo sapiens (Human)
Description:Receptor binding studies use plasma membranes from LLC PK-1 cells transiently transfected with hGHSR1a.
Residue:366
BDBM50365830
NameBDBM50365830
Synonyms:CHEMBL1957009
TypeSmall organic molecule
Emp. Form.C28H31N5O2
Mol. Mass.469.578
SMILESCC(C)N1CCC[C@H](Cn2c(C)nc3ncc(Oc4ccc(cc4)-c4ccccc4)nc3c2=O)C1