Reaction Details
TargetFocal adhesion kinase 1
LigandBDBM4078
Substrate/Competitorn/a
Meas. Tech.ChEMBL_808132 (CHEMBL1961283)
IC50 3110±n/a nM
Citation Hundsdörfer, CHemmerling, HJGötz, CTotzke, FBednarski, PLe Borgne, MJose, J Indeno[1,2-b]indole derivatives as a novel class of potent human protein kinase CK2 inhibitors. Bioorg Med Chem20:2282-9 (2012) 
 
Focal adhesion kinase 1
Name:Focal adhesion kinase 1
Type:Tyrosine-protein kinase
Mol. Mass.:119233.17
Organism:Homo sapiens (Human)
Description:Q05397
Residue:1052
BDBM4078
NameBDBM4078
Synonyms:6,7,13,14-tetrahydroxy-2,9-dioxatetracyclo[6.6.2.0^{4,16}.0^{11,15}]hexadeca-1(14),4(16),5,7,11(15),12-hexaene-3,10-dione ELLAGIC ACID Ellagic acid (18) MLS000069632 cid_5281855
TypeSmall organic molecule
Emp. Form.C14H6O8
Mol. Mass.302.1926
SMILESOc1cc2c3c(oc(=O)c4cc(O)c(O)c(oc2=O)c34)c1O