Reaction Details
TargetP2Y purinoceptor 2
LigandBDBM50366145
Substrate/Competitorn/a
Meas. Tech.ChEMBL_805630 (CHEMBL1960464)
EC50>20000±n/a nM
Citation Van Poecke, SBarrett, MOSanthosh Kumar, TSinnaeve, DMartins, JCJacobson, KAKendall Harden, TVan Calenbergh, S Synthesis and P2Y2 receptor agonist activities of uridine 5'-phosphonate analogues. Bioorg Med Chem20:2304-15 (2012) 
 
P2Y purinoceptor 2
Name:P2Y purinoceptor 2
Type:PROTEIN
Mol. Mass.:42299.21
Organism:Homo sapiens (Human)
Description:ChEMBL_1455361
Residue:377
BDBM50366145
NameBDBM50366145
Synonyms:CHEMBL1957449
TypeSmall organic molecule
Emp. Form.C9H11N2O9P
Mol. Mass.322.1665
SMILESO[C@H]1[C@@H](O)[C@@H](O[C@@H]1OCP([O-])([O-])=O)n1ccc(=O)[nH]c1=O