Reaction Details
TargetPurine nucleoside phosphorylase
LigandBDBM50280448
Substrate/Competitorn/a
Meas. Tech.ChEMBL_162191 (CHEMBL766711)
Ki 1.3±n/a nM
Citation Halazy, SEggenspiller, AEhrhard, ADanzin, C Phosphonate derivatives of N9-benzylguanine: a new class of potent purine nucleoside phosphorylase inhibitors Bioorg Med Chem Lett2:407-410 (1992)    Article
 
Purine nucleoside phosphorylase
Name:Purine nucleoside phosphorylase
Type:Enzyme
Mol. Mass.:32119.53
Organism:Homo sapiens (Human)
Description:n/a
Residue:289
BDBM50280448
NameBDBM50280448
Synonyms:2-{2-[(2-amino-6-oxo-1,6-dihydro-9H-purin-9-yl)methyl]phenyl}-1,1,2-trifluoroethylphosphonate
TypeSmall organic molecule
Emp. Form.C14H11F3N5O4P
Mol. Mass.401.2383
SMILESNc1nc2n(Cc3ccccc3C(F)C(F)(F)P([O-])([O-])=O)cnc2c(=O)[nH]1