Reaction Details
TargetGlutamate receptor ionotropic, NMDA 1
LigandBDBM50281273
Substrate/Competitorn/a
Meas. Tech.ChEBML_140322
Ki 13800±n/a nM
Citation Epperson, JRHewawasam, PMeanwell, NABoissard, CGGribkoff, VKPost-Munson, D Synthesis and excitatory amino acid pharmacology of some novel quinoxalinediones Bioorg Med Chem Lett3:2801-2804 (1993)    Article
 
Glutamate receptor ionotropic, NMDA 1
Name:Glutamate receptor ionotropic, NMDA 1
Type:Enzyme Catalytic Domain
Mol. Mass.:105533.40
Organism:RAT
Description:P35439
Residue:938
BDBM50281273
NameBDBM50281273
Synonyms:(6,7-Dimethyl-2,3-dioxo-3,4-dihydro-2H-quinoxalin-1-yl)-acetic acid | CHEMBL317841
TypeSmall organic molecule
Emp. Form.C12H12N2O4
Mol. Mass.248.2347
SMILESCc1cc2[nH]c(=O)c(=O)n(CC(O)=O)c2cc1C