Reaction Details
TargetTubulin beta-2B chain
LigandBDBM50005480
Substrate/Competitorn/a
Meas. Tech.ChEBML_211171
IC50 2900±n/a nM
Citation Andres, CBernardo, JYan, QHastie, SMacdonald, T Combretatroponeshybrids of combretastatin and colchicine. Synthesis and biochemical evaluation Bioorg Med Chem Lett3:565-570 (1993)    Article
 
Tubulin beta-2B chain
Name:Tubulin beta-2B chain
Type:PROTEIN
Mol. Mass.:49932.38
Organism:Bos taurus
Description:ChEMBL_211651
Residue:445
BDBM50005480
NameBDBM50005480
Synonyms:(-)-combretastatin (Z)-5-(3,4,5-trimethoxystyryl)-2-methoxyphenol (combretastin A-4)2-Methoxy-5-[2-(3,4,5-trimethoxy-phenyl)-vinyl]-phenol 2-Methoxy-5-[(Z)-2-(3,4,5-trimethoxy-phenyl)-vinyl]-phenol 2-methoxy-5-(3,4,5-trimethoxystyryl)phenol 5-(3,4,5-trimethoxystyryl)-2-methoxyphenol CHEMBL67 Combrestatin A4 Combretastatin Combretastin A-4 combretastatin A-4, (CSA4) | combretastin A4
TypeSmall organic molecule
Emp. Form.C18H20O5
Mol. Mass.316.3484
SMILESCOc1ccc(\C=C/c2cc(OC)c(OC)c(OC)c2)cc1O