Reaction Details
TargetAdenosylhomocysteinase
LigandBDBM50006222
Substrate/Competitorn/a
Meas. Tech.ChEBML_197376
IC50 7.2±n/a nM
Citation Siddiqi, SMRaissian, MSchneller, SWIkeda, SSnoeck, RAndrei, GBalzarini, JDe Clerq, E ()-7-deazaaristeromycin lacking the hydroxymethyl substituent Bioorg Med Chem Lett3:663-666 (1993)    Article
 
Adenosylhomocysteinase
Name:Adenosylhomocysteinase
Type:PROTEIN
Mol. Mass.:47714.06
Organism:Homo sapiens (Human)
Description:ChEMBL_1507791
Residue:432
BDBM50006222
NameBDBM50006222
Synonyms:(1S,2R,5R)-5-(6-Amino-purin-9-yl)-3-hydroxymethyl-cyclopent-3-ene-1,2-diol 5-(6-Amino-purin-9-yl)-3-hydroxymethyl-cyclopent-3-ene-1,2-diol 5-(6-Amino-purin-9-yl)-3-hydroxymethyl-cyclopent-3-ene-1,2-diol (Neplonocin A) 5-(6-Amino-purin-9-yl)-3-hydroxymethyl-cyclopent-3-ene-1,2-diol(NPA) CHEMBL8771 | Neplanocin A
TypeSmall organic molecule
Emp. Form.C11H13N5O3
Mol. Mass.263.2526
SMILESNc1ncnc2n(cnc12)[C@@H]1C=C(CO)[C@@H](O)[C@H]1O