Reaction Details
TargetCathepsin B
LigandBDBM50284776
Substrate/Competitorn/a
Meas. Tech.ChEBML_47605
IC50 98±n/a nM
Citation Woo, JSigeizumi, SYamaguchi, KSugimoto, KKobori, TTsuji, TKondo, K Peptidyl aldehyde derivatives as potent and selective inhibitors of cathepsin L Bioorg Med Chem Lett5:1501-1504 (1995)    Article
 
Cathepsin B
Name:Cathepsin B
Type:Enzyme
Mol. Mass.:37819.69
Organism:Homo sapiens (Human)
Description:gi_63102437
Residue:339
BDBM50284776
NameBDBM50284776
Synonyms:CHEMBL36904 | Z-Phe-Tyr(Me)-H
TypeSmall organic molecule
Emp. Form.C27H28N2O6
Mol. Mass.476.521
SMILESCOc1ccc(C[C@H](NC(=O)[C@H](Cc2ccccc2)NC(=O)OCc2ccccc2)C(O)=O)cc1