Reaction Details
TargetMu-type opioid receptor
LigandBDBM50148071
Substrate/Competitorn/a
Meas. Tech.ChEBML_138742
Ki 24±n/a nM
Citation Schmidhammer, HStangl, AFurst, ZSzabo, EBorsodi, APatel, DTraynor, JR Synthesis and biological evaluation of 14-alkoxymorphinans.12.1 A phenethyl analogue of the -selective opioid receptor antagonist cyprodime Bioorg Med Chem Lett5:1923-1926 (1995)    Article
 
Mu-type opioid receptor
Name:Mu-type opioid receptor
Type:Enzyme Catalytic Domain
Mol. Mass.:11165.58
Organism:GUINEA PIG
Description:P97266
Residue:98
BDBM50148071
NameBDBM50148071
Synonyms:(-)-N-(Cycloproylmethyl)-4,14-dimethoxymorphinan-6-one(Cyprodime) 17-cyclopropylmethyl-3,10-dimethoxy-(1R,9R,10S)-17-azatetracyclo[7.5.3.01,10.02,7]heptadeca-2(7),3,5-trien-13-one CYPRODIME BROMIDE cyprodime
TypeSmall organic molecule
Emp. Form.C22H29NO3
Mol. Mass.355.4706
SMILESCOc1cccc2C[C@H]3N(CC4CC4)CC[C@@]4(CC(=O)CC[C@@]34OC)c12