Reaction Details
TargetCholesteryl ester transfer protein
LigandBDBM50286609
Substrate/Competitorn/a
Meas. Tech.ChEMBL_44154 (CHEMBL653305)
IC50 23000±n/a nM
Citation Coval, SJConover, MAMierzwa, RKing, APuar, MSPhife, DWPai, JBurrier, REAhn, HBoykow, GCPatel, MPomponi, SA Wiedendiol-A and -B, cholesteryl ester transfer protein inhibitors from the marine sponge Xestospongia wiedenmayeri Bioorg Med Chem Lett5:605-610 (1995)    Article
 
Cholesteryl ester transfer protein
Name:Cholesteryl ester transfer protein
Type:Enzyme
Mol. Mass.:54751.53
Organism:Homo sapiens (Human)
Description:P11597
Residue:493
BDBM50286609
NameBDBM50286609
Synonyms:1-((4aS,12bR)-9,10-Diacetyl-4,4,4a,12b-tetramethyl-1,3,4,4a,5,6,6a,9,12a,12b-decahydro-2H-benzo[a]xanthen-11-yl)-ethanone | CHEMBL347038
TypeSmall organic molecule
Emp. Form.C27H36O4
Mol. Mass.424.5723
SMILESCC(=O)C1C=C2OC3CC[C@@]4(C)C(C)(C)CCC[C@]4(C)C3C=C2C(C(C)=O)=C1C(C)=O