Reaction Details
TargetCholesteryl ester transfer protein
LigandBDBM50286611
Substrate/Competitorn/a
Meas. Tech.ChEMBL_48927 (CHEMBL660757)
IC50 22000±n/a nM
Citation Coval, SJConover, MAMierzwa, RKing, APuar, MSPhife, DWPai, JBurrier, REAhn, HBoykow, GCPatel, MPomponi, SA Wiedendiol-A and -B, cholesteryl ester transfer protein inhibitors from the marine sponge Xestospongia wiedenmayeri Bioorg Med Chem Lett5:605-610 (1995)    Article
 
Cholesteryl ester transfer protein
Name:Cholesteryl ester transfer protein
Type:Enzyme
Mol. Mass.:54751.53
Organism:Homo sapiens (Human)
Description:P11597
Residue:493
BDBM50286611
NameBDBM50286611
Synonyms:5,5,9,10-tetramethyl-18-oxatetracyclo[8.8.0.01,6.012,17]octadeca-12(17),13,15-trien-14-ol | CHEMBL160123
TypeSmall organic molecule
Emp. Form.C21H30O2
Mol. Mass.314.4617
SMILESC[C@H]1CCC2C(C)(C)CCC[C@]22Oc3ccc(O)cc3C[C@]12C