Reaction Details
TargetDipeptidyl peptidase 4
LigandBDBM12191
Substrate/Competitorn/a
Meas. Tech.ChEMBL_53500 (CHEMBL664122)
Ki 64±n/a nM
Citation Ashworth, DMAtrash, BBaker, GRBaxter, AJJenkins, PDJones, DSzelke, M 2-cyanopyrrolidides as potent, stable inhibitors of dipeptidyl peptidase IV Bioorg Med Chem Lett6:1163-1166 (1996)    Article
 
Dipeptidyl peptidase 4
Name:Dipeptidyl peptidase 4
Type:Enzyme
Mol. Mass.:88271.01
Organism:Homo sapiens (Human)
Description:P27487
Residue:766
BDBM12191
NameBDBM12191
Synonyms:(2S)-2-amino-2-cyclohexyl-1-(pyrrolidin-1-yl)ethan-1-one (S)-2-amino-2-cyclohexyl-1-(pyrrolidin-1-yl)ethanone isoquinoline derivative 14
TypeSmall organic molecule
Emp. Form.C12H22N2O
Mol. Mass.210.3159
SMILESN[C@@H](C1CCCCC1)C(=O)N1CCCC1