Reaction Details
TargetDipeptidyl peptidase 4
LigandBDBM50243406
Substrate/Competitorn/a
Meas. Tech.ChEMBL_53500 (CHEMBL664122)
Ki 7000±n/a nM
Citation Ashworth, DMAtrash, BBaker, GRBaxter, AJJenkins, PDJones, DSzelke, M 2-cyanopyrrolidides as potent, stable inhibitors of dipeptidyl peptidase IV Bioorg Med Chem Lett6:1163-1166 (1996)    Article
 
Dipeptidyl peptidase 4
Name:Dipeptidyl peptidase 4
Type:Enzyme
Mol. Mass.:88271.01
Organism:Homo sapiens (Human)
Description:P27487
Residue:766
BDBM50243406
NameBDBM50243406
Synonyms:(S)-2-amino-1-(pyrrolidin-1-yl)propan-1-one | CHEMBL443622
TypeSmall organic molecule
Emp. Form.C7H14N2O
Mol. Mass.142.1989
SMILESC[C@H](N)C(=O)N1CCCC1