Reaction Details
TargetDipeptidyl peptidase 4
LigandBDBM11644
Substrate/Competitorn/a
Meas. Tech.ChEBML_53500
Ki 1.1±n/a nM
Citation Ashworth, DMAtrash, BBaker, GRBaxter, AJJenkins, PDJones, DSzelke, M 2-cyanopyrrolidides as potent, stable inhibitors of dipeptidyl peptidase IV Bioorg Med Chem Lett6:1163-1166 (1996)    Article
 
Dipeptidyl peptidase 4
Name:Dipeptidyl peptidase 4
Type:Enzyme
Mol. Mass.:88271.01
Organism:Homo sapiens (Human)
Description:P27487
Residue:766
BDBM11644
NameBDBM11644
Synonyms:(2S)-1-[(2S)-2-amino-2-cyclopentylacetyl]pyrrolidine-2-carbonitrile cyanopyrrolidine deriv. 3
TypeSmall organic molecule
Emp. Form.C12H19N3O
Mol. Mass.221.2988
SMILESN[C@@H](C1CCCC1)C(=O)N1CCC[C@H]1C#N