Reaction Details
TargetKynureninase
LigandBDBM50288254
Substrate/Competitorn/a
Meas. Tech.ChEBML_91720
Ki 23400±n/a nM
Citation Ross, FCBotting, NPLeeson, PD Synthesis of phosphinic acid transition state analogues for the reaction catalysed by kynureninase Bioorg Med Chem Lett6:2643-2646 (1996)    Article
 
Kynureninase
Name:Kynureninase
Type:PROTEIN
Mol. Mass.:52356.52
Organism:Homo sapiens (Human)
Description:ChEMBL_91729
Residue:465
BDBM50288254
NameBDBM50288254
Synonyms:2-ammonio-4-oxo-4-phenyl-(2S)-butanoate | CHEMBL315803
TypeSmall organic molecule
Emp. Form.C10H11NO3
Mol. Mass.193.1992
SMILES[NH3+][C@@H](CC(=O)c1ccccc1)C([O-])=O