Reaction Details
TargetProthrombin
LigandBDBM50070632
Substrate/Competitorn/a
Meas. Tech.ChEBML_208536
pH7.5±n/a
Ki 300±n/a nM
Commentsextracted
Citation von der Saal, WKucznierz, RLeinert, HEngh, RA DERIVATIVES OF 4-AMINO-PYRIDINE AS SELECTIVE THROMBIN INHIBITORS Bioorg Med Chem Lett7:1283-1288 (1997)    Article
 
Prothrombin
Name:Prothrombin
Type:Protein
Mol. Mass.:70029.57
Organism:Homo sapiens (Human)
Description:P00734
Residue:622
BDBM50070632
NameBDBM50070632
Synonyms:4-[2-(3-Benzenesulfonylamino-phenoxy)-ethylamino]-pyridinium N-{3-[2-(Pyridin-4-ylamino)-ethoxy]-phenyl}-benzenesulfonamide
TypeSmall organic molecule
Emp. Form.C19H19N3O3S
Mol. Mass.369.437
SMILESO=S(=O)(Nc1cccc(OCCNc2ccncc2)c1)c1ccccc1