Reaction Details
TargetProthrombin
LigandBDBM50290019
Substrate/Competitorn/a
Meas. Tech.ChEBML_207962
IC50 18±n/a nM
Citation Salimbeni, APaleari, FCanevotti, RCriscuoli, MCriscuoli, MLippi, AAngiolini, MBelvisi, LScolastico, CColombo, L Design and synthesis of conformationally constrained arginal thrombin inhibitors Bioorg Med Chem Lett7:2205-2210 (1997)    Article
 
Prothrombin
Name:Prothrombin
Type:Protein
Mol. Mass.:70029.57
Organism:Homo sapiens (Human)
Description:P00734
Residue:622
BDBM50290019
NameBDBM50290019
Synonyms:(3S,6S,9aS)-6-(3-Methyl-1,2,3,4-tetrahydro-quinoline-8-sulfonylamino)-5-oxo-octahydro-pyrrolo[1,2-a]azepine-3-carboxylic acid ((S)-1-carbamimidoyl-2-hydroxy-piperidin-3-yl)-amide; hydrochloride | CHEMBL544760
TypeSmall organic molecule
Emp. Form.C26H39N7O5S
Mol. Mass.561.697
SMILESCC1CNc2c(C1)cccc2S(=O)(=O)N[C@H]1CCC[C@H]2CC[C@H](N2C1=O)C(=O)N[C@H]1CCCN(C1O)C(N)=N