Reaction Details
TargetSubstance-P receptor
LigandBDBM50175494
Substrate/Competitorn/a
Meas. Tech.ChEBML_142889
IC50 3±n/a nM
Citation Maynard, GDBratton, LDKane, JMBurkholder, TPSantiago, BStewart, KTKudlacz, EMShatzer, SAKnippenberg, RWFarrell, AMLogan, DE Synthesis and sar of 4-(1H-benzimidazole-2-carbonyl)piperidines with dual histamine H1/tachykinin NK1 receptor antagonist activity Bioorg Med Chem Lett7:2819-2824 (1997)    Article
 
Substance-P receptor
Name:Substance-P receptor
Type:G Protein-Coupled Receptor (GPCR)
Mol. Mass.:46254.43
Organism:Homo sapiens (Human)
Description:P25103
Residue:407
BDBM50175494
NameBDBM50175494
Synonyms:1-{2-[(R)-3-(3,4-Dichloro-phenyl)-1-(3,4,5-trimethoxy-benzoyl)-pyrrolidin-3-yl]-ethyl}-4-phenyl-piperidine-4-carboxylic acid amide CHEMBL330366 MDL-105212
TypeSmall organic molecule
Emp. Form.C34H39Cl2N3O5
Mol. Mass.640.597
SMILESCOc1cc(cc(OC)c1OC)C(=O)N1CC[C@@](CCN2CCC(CC2)(C(N)=O)c2ccccc2)(C1)c1ccc(Cl)c(Cl)c1