Reaction Details
TargetHistamine H3 receptor
LigandBDBM22541
Substrate/Competitorn/a
Meas. Tech.ChEBML_86896
Ki 0.180000±n/a nM
Citation Khan, MYates, SLTedford, CEKirschbaum, KPhillips, JG Diastereoselective synthesis of trans-2-(1-triphenylmethyl-1H-imidazol-4-yl)cyclopropanecarboxylic acids: key intermediates for the preparation of potent and chiral histamine H3 receptor agents Bioorg Med Chem Lett7:3017-3022 (1997)    Article
 
Histamine H3 receptor
Name:Histamine H3 receptor
Type:G Protein-Coupled Receptor (GPCR)
Mol. Mass.:48607.98
Organism:Rattus norvegicus (rat)
Description:n/a
Residue:445
BDBM22541
NameBDBM22541
Synonyms:Clobenpropit VUF 9153 VUF9153
TypeSmall organic molecule
Emp. Form.C14H17ClN4S
Mol. Mass.308.83
SMILESNC(SCCCc1cnc[nH]1)=NCc1ccc(Cl)cc1