Reaction Details
TargetTyrosine-protein kinase Lck
LigandBDBM25116
Substrate/Competitorn/a
Meas. Tech.ChEBML_221310
IC50 5±n/a nM
Citation Myers, MRSetzer, NNSpada, AZulli, ALHsu, CJZilberstein, AJohnson, SEHook, LEJacoski, MV The preparation and sar of 4-(anilino), 4-(phenoxy), and 4-(thiophenoxy)-quinazolines: Inhibitors of p56lck and EGF-R tyrosine kinase activity Bioorg Med Chem Lett7:417-420 (1997)    Article
 
Tyrosine-protein kinase Lck
Name:Tyrosine-protein kinase Lck
Type:n/a
Mol. Mass.:57987.83
Organism:Homo sapiens (Human)
Description:P06239
Residue:509
BDBM25116
NameBDBM25116
Synonyms:1-tert-butyl-3-(4-methylphenyl)-1H-pyrazolo[3,4-d]pyrimidin-4-amine PP1 US10807986, Comparative compound 1 US11701353, PP1 (Pfizer) | cid_1400
TypeSmall organic molecule
Emp. Form.C16H19N5
Mol. Mass.281.3556
SMILESCc1ccc(cc1)-c1nn(c2ncnc(N)c12)C(C)(C)C