Reaction Details
TargetPapain
LigandBDBM50070495
Substrate/Competitorn/a
Meas. Tech.ChEMBL_152523 (CHEMBL757558)
IC50 130±n/a nM
Citation Bajusz, SFauszt, INémeth, KBarabás, EJuhász, APatthy, M Peptidyl beta-homo-aspartals: specific inhibitors of interleukin-1 beta converting enzyme and its homologues (caspases). Bioorg Med Chem Lett8:1477-82 (1999) Papain
Name:Papain
Type:Enzyme
Mol. Mass.:38923.01
Organism:Carica papaya
Description:Papain was purchased from Sigma, Germany.
Residue:345
BDBM50070495
NameBDBM50070495
Synonyms:CHEMBL290218 | [(S)-1-((S)-1-Formyl-4-guanidino-butylcarbamoyl)-2-phenyl-ethyl]-carbamic acid isobutyl ester
TypeSmall organic molecule
Emp. Form.C20H31N5O4
Mol. Mass.405.4912
SMILESCC(C)COC(=O)N[C@@H](Cc1ccccc1)C(=O)N[C@@H](CCCNC(N)=N)C=O