Reaction Details
TargetPapain
LigandBDBM50366497
Substrate/Competitorn/a
Meas. Tech.ChEMBL_152523 (CHEMBL757558)
IC50 70±n/a nM
Citation Bajusz, SFauszt, INémeth, KBarabás, EJuhász, APatthy, M Peptidyl beta-homo-aspartals: specific inhibitors of interleukin-1 beta converting enzyme and its homologues (caspases). Bioorg Med Chem Lett8:1477-82 (1999) Papain
Name:Papain
Type:Enzyme
Mol. Mass.:38923.01
Organism:Carica papaya
Description:Papain was purchased from Sigma, Germany.
Residue:345
BDBM50366497
NameBDBM50366497
Synonyms:CHEMBL1790164
TypeSmall organic molecule
Emp. Form.C29H40N6O5
Mol. Mass.552.6651
SMILES[#6]-[#6]-[#6@H](-[#6])-[#6@H](-[#7]-[#6](=O)-[#6@H](-[#6]-[#6]-[#6]\[#7]=[#6](\[#7])-[#7])-[#7]-[#6](=O)-[#8]-[#6]-c1ccccc1)-[#6](=O)-[#7]-[#6@@H](-[#6]-c1ccccc1)-[#6]=O