Reaction Details
TargetMuscarinic acetylcholine receptor M1
LigandBDBM50071171
Substrate/Competitorn/a
Meas. Tech.ChEBML_139527
IC50 6559±n/a nM
Citation Augelli-Szafran, CEJaen, JCMoreland, DWNelson, CBPenvose-Yi, JRSchwarz, RD Identification and characterization of m4 selective muscarinic antagonists. Bioorg Med Chem Lett8:1991-6 (1999) Muscarinic acetylcholine receptor M1
Name:Muscarinic acetylcholine receptor M1
Type:Protein
Mol. Mass.:51442.54
Organism:Homo sapiens (Human)
Description:P11229
Residue:460
BDBM50071171
NameBDBM50071171
Synonyms:9-Methoxy-2-methyl-11,12-dihydro-3H,6aH,13H-6-oxa-3,12a-diaza-benzo[a]cyclopenta[h]anthracene-1-carboxylic acid ethyl ester | CHEMBL59898
TypeSmall organic molecule
Emp. Form.C23H24N2O4
Mol. Mass.392.4477
SMILESCCOC(=O)c1c(C)[nH]c2ccc3OC4N(CCc5cc(OC)ccc45)Cc3c12