Reaction Details
TargetMuscarinic acetylcholine receptor M2
LigandBDBM81462
Substrate/Competitorn/a
Meas. Tech.ChEBML_138344
IC50 19±n/a nM
Citation Augelli-Szafran, CEJaen, JCMoreland, DWNelson, CBPenvose-Yi, JRSchwarz, RD Identification and characterization of m4 selective muscarinic antagonists. Bioorg Med Chem Lett8:1991-6 (1999) Muscarinic acetylcholine receptor M2
Name:Muscarinic acetylcholine receptor M2
Type:GPCR
Mol. Mass.:51730.61
Organism:Homo sapiens (Human)
Description:P08172
Residue:466
BDBM81462
NameBDBM81462
Synonyms:(R)-Trihexyphenidyl Benzhexol NSC_5572 Trihexyphenidyl
TypeSmall organic molecule
Emp. Form.C20H31NO
Mol. Mass.301.4662
SMILESOC(CCN1CCCCC1)(C1CCCCC1)c1ccccc1