Reaction Details
TargetKynurenine 3-monooxygenase
LigandBDBM50072254
Substrate/Competitorn/a
Meas. Tech.ChEBML_216338
IC50 10400±n/a nM
Citation Giordani, APevarello, PCini, MBormetti, RGreco, FToma, SSpeciale, CVarasi, M 4-Phenyl-4-oxo-butanoic acid derivatives inhibitors of kynurenine 3-hydroxylase. Bioorg Med Chem Lett8:2907-12 (1999) Kynurenine 3-monooxygenase
Name:Kynurenine 3-monooxygenase
Type:PROTEIN
Mol. Mass.:54371.88
Organism:Rattus norvegicus
Description:ChEMBL_1487468
Residue:478
BDBM50072254
NameBDBM50072254
Synonyms:(E)-4-(3,4-Dichloro-phenyl)-4-oxo-but-2-enoic acid | CHEMBL98963
TypeSmall organic molecule
Emp. Form.C10H6Cl2O3
Mol. Mass.245.059
SMILESOC(=O)\C=C\C(=O)c1ccc(Cl)c(Cl)c1