Reaction Details
TargetGTPase HRas
LigandBDBM50055659
Substrate/Competitorn/a
Meas. Tech.ChEBML_82665
IC50>200000±n/a nM
Citation Baraldi, PGCacciari, BGuiotto, ALeoni, ARomagnoli, RSpalluto, GMongelli, NHoward, PWThurston, DEBianchi, NGambari, R Design, synthesis and biological activity of a pyrrolo [2,1-c][1,4]benzodiazepine (PBD)-distamycin hybrid. Bioorg Med Chem Lett8:3019-24 (1999) 
 
GTPase HRas
Name:GTPase HRas
Type:Other Protein Type
Mol. Mass.:21293.37
Organism:Homo sapiens (Human)
Description:P01112
Residue:189
BDBM50055659
NameBDBM50055659
Synonyms:2N-(3,3-aminoiminopropyl)-4-[4-(4-formamido-1-methyl-1H-2-pyrrolylcarboxamido)-1-methyl-1H-2-pyrrolylcarboxamido]-1-methyl-1H-2-pyrrolecarboxamide 2N-[5-(3-amino-3-iminopropylcarbamoyl)-1-methyl-1H-3-pyrrolyl]-4-(4-formamido-1-methyl-1H-2-pyrrolylcarboxamido)-1-methyl-1H-2-pyrrolecarboxamide(Distamycin) 4N-[5-(3-amino-3-iminopropylcarbamoyl)-1-methyl-1H-2-pyrrolyl]-2-(4-formamido-1-methyl-1H-2-pyrrolylcarboxamido)-1-methyl-1H-4-pyrrolecarboxamide CHEMBL101290 DISTAMYCIN cid_6602691
TypeSmall organic molecule
Emp. Form.C22H27N9O4
Mol. Mass.481.5077
SMILESCn1cc(NC=O)cc1C(=O)Nc1cc(C(=O)Nc2cc(C(=O)NCCC(N)=N)n(C)c2)n(C)c1