Reaction Details
TargetAminopeptidase N
LigandBDBM50075329
Substrate/Competitorn/a
Meas. Tech.ChEMBL_35494 (CHEMBL646404)
IC50>325000±n/a nM
Citation Shimazawa, RTakayama, HKato, FKato, MHashimoto, Y Nonpeptide small-molecular inhibitors of dipeptidyl peptidase IV: N-phenylphthalimide analogs. Bioorg Med Chem Lett9:559-62 (1999) Aminopeptidase N
Name:Aminopeptidase N
Type:PROTEIN
Mol. Mass.:109522.63
Organism:Homo sapiens (Human)
Description:ChEMBL_1507526
Residue:967
BDBM50075329
NameBDBM50075329
Synonyms:2-(2,6-Diisopropyl-phenyl)-isoindole-1,3-dione CHEMBL89081
TypeSmall organic molecule
Emp. Form.C20H21NO2
Mol. Mass.307.3862
SMILESCC(C)c1cccc(C(C)C)c1N1C(=O)c2ccccc2C1=O