Reaction Details
TargetAminopeptidase N
LigandBDBM50075332
Substrate/Competitorn/a
Meas. Tech.ChEMBL_35494 (CHEMBL646404)
IC50>318000±n/a nM
Citation Shimazawa, RTakayama, HKato, FKato, MHashimoto, Y Nonpeptide small-molecular inhibitors of dipeptidyl peptidase IV: N-phenylphthalimide analogs. Bioorg Med Chem Lett9:559-62 (1999) Aminopeptidase N
Name:Aminopeptidase N
Type:PROTEIN
Mol. Mass.:109522.63
Organism:Homo sapiens (Human)
Description:ChEMBL_1507526
Residue:967
BDBM50075332
NameBDBM50075332
Synonyms:2-(2-Methylsulfanyl-phenyl)-4-nitro-isoindole-1,3-dione | CHEMBL153236
TypeSmall organic molecule
Emp. Form.C15H10N2O4S
Mol. Mass.314.316
SMILESCSc1ccccc1N1C(=O)c2cccc(c2C1=O)[N+]([O-])=O