Reaction Details
TargetAminopeptidase N
LigandBDBM50075327
Substrate/Competitorn/a
Meas. Tech.ChEBML_35494
IC50>471000±n/a nM
Citation Shimazawa, RTakayama, HKato, FKato, MHashimoto, Y Nonpeptide small-molecular inhibitors of dipeptidyl peptidase IV: N-phenylphthalimide analogs. Bioorg Med Chem Lett9:559-62 (1999) Aminopeptidase N
Name:Aminopeptidase N
Type:PROTEIN
Mol. Mass.:109522.63
Organism:Homo sapiens (Human)
Description:ChEMBL_1507526
Residue:967
BDBM50075327
NameBDBM50075327
Synonyms:CHEMBL151461 | Pro-boroPro (PBP)
TypeSmall organic molecule
Emp. Form.C10H18BNO3
Mol. Mass.211.066
SMILESOB(O)[C@@H]1CCCC1C(=O)[C@@H]1CCCN1