Reaction Details
TargetAminopeptidase N
LigandBDBM50075330
Substrate/Competitorn/a
Meas. Tech.ChEBML_35494
IC50 28800±n/a nM
Citation Shimazawa, RTakayama, HKato, FKato, MHashimoto, Y Nonpeptide small-molecular inhibitors of dipeptidyl peptidase IV: N-phenylphthalimide analogs. Bioorg Med Chem Lett9:559-62 (1999) Aminopeptidase N
Name:Aminopeptidase N
Type:PROTEIN
Mol. Mass.:109522.63
Organism:Homo sapiens (Human)
Description:ChEMBL_1507526
Residue:967
BDBM50075330
NameBDBM50075330
Synonyms:2-(2,6-Diisopropyl-phenyl)-4,5,6,7-tetrafluoro-3-thioxo-2,3-dihydro-isoindol-1-one | CHEMBL151999
TypeSmall organic molecule
Emp. Form.C20H17F4NOS
Mol. Mass.395.414
SMILESCC(C)c1cccc(C(C)C)c1N1C(=O)c2c(C1=S)c(F)c(F)c(F)c2F