Reaction Details
TargetMu-type opioid receptor
LigandBDBM50089071
Substrate/Competitorn/a
Meas. Tech.ChEMBL_149004 (CHEMBL757988)
Ki 1620±n/a nM
Citation Longobardo, LMelck, DSiciliano, RSantini, ADi Marzo, VCammarota, G Beta-casomorphins: substitution of phenylalanine with beta-homo phenylalanine increases the mu-type opioid receptor affinity. Bioorg Med Chem Lett10:1185-8 (2000) Mu-type opioid receptor
Name:Mu-type opioid receptor
Type:G Protein-Coupled Receptor (GPCR)
Mol. Mass.:44503.11
Organism:Rattus norvegicus (rat)
Description:Competition binding assays were carried out using membrane preparations from transfected HN9.10 cells that constitutively expressed the mu opioid receptor.
Residue:398
BDBM50089071
NameBDBM50089071
Synonyms:({1-[2-({1-[2-Amino-3-(4-hydroxy-phenyl)-propionyl]-pyrrolidine-2-carbonyl}-amino)-3-phenyl-propionyl]-pyrrolidine-2-carbonyl}-amino)-acetic acid | CHEMBL2370515
TypeSmall organic molecule
Emp. Form.C30H37N5O7
Mol. Mass.579.6441
SMILESN[C@@H](Cc1ccc(O)cc1)C(=O)N1CCC[C@H]1C(=O)N[C@@H](Cc1ccccc1)C(=O)N1CCC[C@H]1C(=O)NCC(O)=O