Reaction Details
TargetPancreatic alpha-amylase
LigandBDBM50090254
Substrate/Competitorn/a
Meas. Tech.ChEMBL_34103 (CHEMBL649732)
Ki<40000±n/a nM
Citation Gerrard, JAPrince, MJAbell, AD Kinetic characterisation of ene-diol-based inhibitors of alpha-amylase. Bioorg Med Chem Lett10:1575-6 (2000) Pancreatic alpha-amylase
Name:Pancreatic alpha-amylase
Type:PROTEIN
Mol. Mass.:57186.64
Organism:Rattus norvegicus
Description:ChEMBL_34101
Residue:508
BDBM50090254
NameBDBM50090254
Synonyms:(R)-5-((S)-2,2-Dimethyl-[1,3]dioxolan-4-yl)-3,4-dihydroxy-5H-furan-2-one | CHEMBL39670
TypeSmall organic molecule
Emp. Form.C9H12O6
Mol. Mass.216.188
SMILESCC1(C)OC[C@H](O1)c1oc(O)c(O)c1O