Reaction Details
TargetEstrogen receptor
LigandBDBM50366657
Substrate/Competitorn/a
Meas. Tech.ChEMBL_67352 (CHEMBL676807)
EC50 336±n/a nM
Citation Miller, CPJirkovsky, ITran, BDHarris, HAMoran, RAKomm, BS Synthesis and estrogenic activities of novel 7-thiosubstituted estratriene derivatives. Bioorg Med Chem Lett10:147-51 (2000) Estrogen receptor
Name:Estrogen receptor
Type:Protein
Mol. Mass.:66230.44
Organism:Homo sapiens (Human)
Description:P03372
Residue:595
BDBM50366657
NameBDBM50366657
Synonyms:CHEMBL1627361
TypeSmall organic molecule
Emp. Form.C32H43NO3S
Mol. Mass.521.754
SMILESCOc1ccc2[C@H]3CC[C@]4(C)[C@@H](O)CC[C@H]4[C@@H]3[C@@H](Cc2c1)Sc1ccc(OCCN2CCCCC2)cc1