Reaction Details
TargetEstrogen receptor beta
LigandBDBM50041611
Substrate/Competitorn/a
Meas. Tech.ChEBML_67812
IC50 56±n/a nM
Citation Miller, CPJirkovsky, ITran, BDHarris, HAMoran, RAKomm, BS Synthesis and estrogenic activities of novel 7-thiosubstituted estratriene derivatives. Bioorg Med Chem Lett10:147-51 (2000) Estrogen receptor beta
Name:Estrogen receptor beta
Type:Protein
Mol. Mass.:59238.43
Organism:Homo sapiens (Human)
Description:Q92731
Residue:530
BDBM50041611
NameBDBM50041611
Synonyms:(2E)-3-{4-[(1E)-1,2-DIPHENYLBUT-1-ENYL]PHENYL}ACRYLIC ACID CHEMBL33899
TypeSmall organic molecule
Emp. Form.C25H22O2
Mol. Mass.354.441
SMILESCC\C(=C(/c1ccccc1)c1ccc(\C=C\C(O)=O)cc1)c1ccccc1