Reaction Details
TargetEstrogen receptor beta
LigandBDBM50366664
Substrate/Competitorn/a
Meas. Tech.ChEBML_67812
IC50 63±n/a nM
Citation Miller, CPJirkovsky, ITran, BDHarris, HAMoran, RAKomm, BS Synthesis and estrogenic activities of novel 7-thiosubstituted estratriene derivatives. Bioorg Med Chem Lett10:147-51 (2000) Estrogen receptor beta
Name:Estrogen receptor beta
Type:Protein
Mol. Mass.:59238.43
Organism:Homo sapiens (Human)
Description:Q92731
Residue:530
BDBM50366664
NameBDBM50366664
Synonyms:CHEMBL1627353
TypeSmall organic molecule
Emp. Form.C24H27BrO3S
Mol. Mass.475.438
SMILESC[C@]12CC[C@H]3[C@H]([C@@H]1CC[C@@H]2O)[C@H](Sc1ccc(Br)cc1)C(O)c1cc(O)ccc31