Reaction Details
Target5-hydroxytryptamine receptor 1A
LigandBDBM50218391
Substrate/Competitorn/a
Meas. Tech.ChEMBL_1456 (CHEMBL616579)
Ki 14±n/a nM
Citation Fujio, MKuroita, TSakai, YNakagawa, HMatsumoto, Y N-[1-(2-Phenylethyl)pyrrolidin-3-yl]-1-adamantanecarboxamides as novel 5-HT2 receptor antagonists. Bioorg Med Chem Lett10:2457-61 (2001) 5-hydroxytryptamine receptor 1A
Name:5-hydroxytryptamine receptor 1A
Type:G Protein-Coupled Receptor (GPCR)
Mol. Mass.:46445.29
Organism:Rattus norvegicus (rat)
Description:Binding assays were performed using rat hippocampal membranes.
Residue:422
BDBM50218391
NameBDBM50218391
Synonyms:CHEMBL79528
TypeSmall organic molecule
Emp. Form.C23H31FN2O
Mol. Mass.370.5034
SMILESFc1cccc(CCN2CCC(C2)NC(=O)C23CC4CC(CC(C4)C2)C3)c1