Reaction Details
Target5-hydroxytryptamine receptor 1A
LigandBDBM50218401
Substrate/Competitorn/a
Meas. Tech.ChEMBL_1456 (CHEMBL616579)
Ki 160±n/a nM
Citation Fujio, MKuroita, TSakai, YNakagawa, HMatsumoto, Y N-[1-(2-Phenylethyl)pyrrolidin-3-yl]-1-adamantanecarboxamides as novel 5-HT2 receptor antagonists. Bioorg Med Chem Lett10:2457-61 (2001) 5-hydroxytryptamine receptor 1A
Name:5-hydroxytryptamine receptor 1A
Type:G Protein-Coupled Receptor (GPCR)
Mol. Mass.:46445.29
Organism:Rattus norvegicus (rat)
Description:Binding assays were performed using rat hippocampal membranes.
Residue:422
BDBM50218401
NameBDBM50218401
Synonyms:CHEMBL309551
TypeSmall organic molecule
Emp. Form.C19H28N2O
Mol. Mass.300.4384
SMILESO=C(N[C@H]1CCN(CCc2ccccc2)C1)C1CCCCC1