Reaction Details
Target5-hydroxytryptamine receptor 1A
LigandBDBM50218392
Substrate/Competitorn/a
Meas. Tech.ChEMBL_1456 (CHEMBL616579)
Ki 20±n/a nM
Citation Fujio, MKuroita, TSakai, YNakagawa, HMatsumoto, Y N-[1-(2-Phenylethyl)pyrrolidin-3-yl]-1-adamantanecarboxamides as novel 5-HT2 receptor antagonists. Bioorg Med Chem Lett10:2457-61 (2001) 5-hydroxytryptamine receptor 1A
Name:5-hydroxytryptamine receptor 1A
Type:G Protein-Coupled Receptor (GPCR)
Mol. Mass.:46445.29
Organism:Rattus norvegicus (rat)
Description:Binding assays were performed using rat hippocampal membranes.
Residue:422
BDBM50218392
NameBDBM50218392
Synonyms:CHEMBL79277
TypeSmall organic molecule
Emp. Form.C23H31FN2O
Mol. Mass.370.5034
SMILESFc1ccccc1CCN1CCC(C1)NC(=O)C12CC3CC(CC(C3)C1)C2