Reaction Details
TargetAcetylcholinesterase
LigandBDBM50093799
Substrate/Competitorn/a
Meas. Tech.ChEMBL_27827 (CHEMBL636716)
Ki 30.9±n/a nM
Citation Rajendran, VPrakash, KRVed, HSSaxena, ADoctor, BPKozikowski, AP Synthesis, chiral chromatographic separation, and biological activities of the enantiomers of 10,10-dimethylhuperzine A. Bioorg Med Chem Lett10:2467-9 (2001) Acetylcholinesterase
Name:Acetylcholinesterase
Type:Enzyme
Mol. Mass.:67659.62
Organism:Bos taurus (bovine)
Description:n/a
Residue:613
BDBM50093799
NameBDBM50093799
Synonyms:(R)-1-Amino-13-eth-(E)-ylidene-8,8,11-trimethyl-6-aza-tricyclo[7.3.1.0*2,7*]trideca-2(7),3,10-trien-5-one CHEMBL79874
TypeSmall organic molecule
Emp. Form.C17H22N2O
Mol. Mass.270.3694
SMILESC\C=C1/C2C=C(C)C[C@]1(N)c1ccc(=O)[nH]c1C2(C)C