Reaction Details
Target72 kDa type IV collagenase
LigandBDBM50063917
Substrate/Competitorn/a
Meas. Tech.ChEBML_104386
IC50 0.750000±n/a nM
Citation Barta, TEBecker, DPBedell, LJDe Crescenzo, GAMcDonald, JJMunie, GERao, SShieh, HSStegeman, RStevens, AMVillamil, CI Synthesis and activity of selective MMP inhibitors with an aryl backbone. Bioorg Med Chem Lett10:2815-7 (2000) 72 kDa type IV collagenase
Name:72 kDa type IV collagenase
Type:Enzyme
Mol. Mass.:73870.36
Organism:Homo sapiens (Human)
Description: P08253
Residue:660
BDBM50063917
NameBDBM50063917
Synonyms:(2S,3R)-N(4)-[(2S)-3,3-dimethyl-1-(methylamino)-1-oxobutan-2-yl]-N(1),2-dihydroxy-3-(2-methylpropyl)butanediamide cid_119031 | marimastat
TypeSmall organic molecule
Emp. Form.C15H29N3O5
Mol. Mass.331.4079
SMILESCNC(=O)[C@@H](NC(=O)[C@H](CC(C)C)[C@H](O)C(=O)NO)C(C)(C)C