Reaction Details
TargetTyrosine-protein phosphatase non-receptor type 1
LigandBDBM50086647
Substrate/Competitorn/a
Meas. Tech.ChEBML_162443
Ki 410000±n/a nM
Citation Ibrahimi, OAWu, LZhao, KZhang, ZY Synthesis and characterization of a novel class of protein tyrosine phosphatase inhibitors. Bioorg Med Chem Lett10:457-60 (2000) Tyrosine-protein phosphatase non-receptor type 1
Name:Tyrosine-protein phosphatase non-receptor type 1
Type:Protein phosphatase
Mol. Mass.:49963.76
Organism:Homo sapiens (Human)
Description:Human recombinant GST-fusion PTP1B (1-435).
Residue:435
BDBM50086647
NameBDBM50086647
Synonyms:hydrogen (1-phenanthryloxy)methylphosphonate
TypeSmall organic molecule
Emp. Form.C15H12O4P
Mol. Mass.287.2277
SMILESOP([O-])(=O)COc1cccc2c1ccc1ccccc21