Reaction Details
TargetTyrosine-protein phosphatase non-receptor type 1
LigandBDBM50086649
Substrate/Competitorn/a
Meas. Tech.ChEBML_162443
Ki 1300000±n/a nM
Citation Ibrahimi, OAWu, LZhao, KZhang, ZY Synthesis and characterization of a novel class of protein tyrosine phosphatase inhibitors. Bioorg Med Chem Lett10:457-60 (2000) Tyrosine-protein phosphatase non-receptor type 1
Name:Tyrosine-protein phosphatase non-receptor type 1
Type:Protein phosphatase
Mol. Mass.:49963.76
Organism:Homo sapiens (Human)
Description:Human recombinant GST-fusion PTP1B (1-435).
Residue:435
BDBM50086649
NameBDBM50086649
Synonyms:hydrogen (1-naphthyloxy)methylphosphonate
TypeSmall organic molecule
Emp. Form.C11H10O4P
Mol. Mass.237.169
SMILESOP([O-])(=O)COc1cccc2ccccc12