Reaction Details
TargetDual specificity protein phosphatase 3
LigandBDBM50086644
Substrate/Competitorn/a
Meas. Tech.ChEBML_214525
Ki 2600000±n/a nM
Citation Ibrahimi, OAWu, LZhao, KZhang, ZY Synthesis and characterization of a novel class of protein tyrosine phosphatase inhibitors. Bioorg Med Chem Lett10:457-60 (2000) Dual specificity protein phosphatase 3
Name:Dual specificity protein phosphatase 3
Type:Hydrolase
Mol. Mass.:20480.58
Organism:Homo sapiens (Human)
Description:n/a
Residue:185
BDBM50086644
NameBDBM50086644
Synonyms:[4-(carboxymethyl)phenoxy]methylphosphonate
TypeSmall organic molecule
Emp. Form.C9H9O6P
Mol. Mass.244.139
SMILESOC(=O)Cc1ccc(OCP([O-])([O-])=O)cc1