Reaction Details
TargetAlpha-2A adrenergic receptor
LigandBDBM50013515
Substrate/Competitorn/a
Meas. Tech.ChEBML_33064
Ki 0.420000±n/a nM
Citation Zheng, WLei, LLalchandani, SSun, GFeller, DRMiller, DD Yohimbine dimers exhibiting binding selectivities for human alpha2a- versus alpha2b-adrenergic receptors. Bioorg Med Chem Lett10:627-30 (2000) Alpha-2A adrenergic receptor
Name:Alpha-2A adrenergic receptor
Type:Enzyme
Mol. Mass.:48979.91
Organism:Homo sapiens (Human)
Description:P08913
Residue:465
BDBM50013515
NameBDBM50013515
Synonyms:(+)-yohimbine 17alpha-hydroxyyohimban-16alpha-carboxylic acid methyl ester CORYNANTHINE Quebrachin YOHIMBINE CHLORIDE Yohimbine cid_8969 methyl 17alpha-hydroxyyohimban-16alpha-carboxylate yohimbic acid methyl ester
TypeSmall organic molecule
Emp. Form.C21H26N2O3
Mol. Mass.354.4427
SMILESCOC(=O)[C@H]1[C@@H](O)CC[C@H]2CN3CCc4c([nH]c5ccccc45)[C@@H]3C[C@H]12