Reaction Details
TargetFructose-1,6-bisphosphatase 1
LigandBDBM50095261
Substrate/Competitorn/a
Meas. Tech.ChEBML_86713
IC50 1600±n/a nM
Citation Wright, SWHageman, DLMcClure, LDCarlo, AATreadway, JLMathiowetz, AMWithka, JMBauer, PH Allosteric inhibition of fructose-1,6-bisphosphatase by anilinoquinazolines. Bioorg Med Chem Lett11:17-21 (2001) Fructose-1,6-bisphosphatase 1
Name:Fructose-1,6-bisphosphatase 1
Type:Protein
Mol. Mass.:36843.58
Organism:Homo sapiens (Human)
Description:Liver FBPase (P09467)
Residue:338
BDBM50095261
NameBDBM50095261
Synonyms:(3-Chloro-phenyl)-(6,7-diethoxy-quinazolin-4-yl)-amine CHEMBL64950
TypeSmall organic molecule
Emp. Form.C18H18ClN3O2
Mol. Mass.343.807
SMILESCCOc1cc2ncnc(Nc3cccc(Cl)c3)c2cc1OCC