Reaction Details
TargetFructose-1,6-bisphosphatase 1
LigandBDBM50095266
Substrate/Competitorn/a
Meas. Tech.ChEBML_86713
IC50 530±n/a nM
Citation Wright, SWHageman, DLMcClure, LDCarlo, AATreadway, JLMathiowetz, AMWithka, JMBauer, PH Allosteric inhibition of fructose-1,6-bisphosphatase by anilinoquinazolines. Bioorg Med Chem Lett11:17-21 (2001) Fructose-1,6-bisphosphatase 1
Name:Fructose-1,6-bisphosphatase 1
Type:Protein
Mol. Mass.:36843.58
Organism:Homo sapiens (Human)
Description:Liver FBPase (P09467)
Residue:338
BDBM50095266
NameBDBM50095266
Synonyms:(3-Chloro-4-fluoro-phenyl)-(6,7-diethoxy-quinazolin-4-yl)-amine | CHEMBL63676
TypeSmall organic molecule
Emp. Form.C18H17ClFN3O2
Mol. Mass.361.798
SMILESCCOc1cc2ncnc(Nc3ccc(F)c(Cl)c3)c2cc1OCC