Reaction Details
TargetFructose-1,6-bisphosphatase 1
LigandBDBM3556
Substrate/Competitorn/a
Meas. Tech.ChEBML_192347
IC50>10000±n/a nM
Citation Wright, SWHageman, DLMcClure, LDCarlo, AATreadway, JLMathiowetz, AMWithka, JMBauer, PH Allosteric inhibition of fructose-1,6-bisphosphatase by anilinoquinazolines. Bioorg Med Chem Lett11:17-21 (2001) Fructose-1,6-bisphosphatase 1
Name:Fructose-1,6-bisphosphatase 1
Type:PROTEIN
Mol. Mass.:39605.40
Organism:Rattus norvegicus
Description:ChEMBL_595158
Residue:363
BDBM3556
NameBDBM3556
Synonyms:4-[(3-Bromophenyl)amino]-6,7-diethoxyquinazoline CHEMBL35820 PD153035 Analog | PD153035 Analog 56
TypeSmall organic molecule
Emp. Form.C18H18BrN3O2
Mol. Mass.388.258
SMILESCCOc1cc2ncnc(Nc3cccc(Br)c3)c2cc1OCC