Reaction Details
TargetInterstitial collagenase
LigandBDBM50096463
Substrate/Competitorn/a
Meas. Tech.ChEBML_106310
IC50 143±n/a nM
Citation Levin, JIChen, JDu, MHogan, MKincaid, SNelson, FCVenkatesan, AMWehr, TZask, ADiJoseph, JKillar, LMSkala, SSung, ASharr, MRoth, CJin, GCowling, RMohler, KMBlack, RAMarch, CJSkotnicki, JS The discovery of anthranilic acid-based MMP inhibitors. Part 2: SAR of the 5-position and P1(1) groups. Bioorg Med Chem Lett11:2189-92 (2001) Interstitial collagenase
Name:Interstitial collagenase
Type:Enzyme
Mol. Mass.:54010.26
Organism:Homo sapiens (Human)
Description: P03956
Residue:469
BDBM50096463
NameBDBM50096463
Synonyms:CHEMBL70176 N-hydroxy-2-(4-methoxy-N-(pyridin-3-ylmethyl)phenylsulfonamido)-3-methylbenzamide
TypeSmall organic molecule
Emp. Form.C21H21N3O5S
Mol. Mass.427.474
SMILESCOc1ccc(cc1)S(=O)(=O)N(Cc1cccnc1)c1c(C)cccc1C(=O)NO